{"text_format":"1","workbook":"xlsx","n_sheets":8,"sheets":["Cover","Instructions","VerCon","Assumptions","Calculations","Fee Schedule - Annual","Fee Schedule - QTR","Table"],"not_rendered":{"charts":1,"images":1,"macros":1,"external_links":0,"defined_names":1937,"comments":0,"pivot_tables":0},"unopened":[],"bounds":{"document_bytes":16777216,"sheet_cells":100000,"rows_first":2000,"rows_last":500,"rows_between":2000,"halvings":0,"cell_chars":16384,"cell_head_chars":4096},"cells_cut":0,"cells_raw":0,"read":"whole","date_system":"1900"}

{"sheet":"Cover","index":0,"n_rows":13,"n_cols":2,"rows_kept":13,"cut":false,"hidden":false,"merged":[]}
[]
[]
[]
[]
[]
[]
[]
[]
[]
[]
[]
[]
[null,{"$f":"MdlTtl","v":"SW REZ - DRAFT - Access Fee Calculator"}]

{"sheet":"Instructions","index":1,"n_rows":62,"n_cols":4,"rows_kept":62,"cut":false,"hidden":false,"merged":[[6,0,6,2],[58,1,58,13],[52,1,52,13],[53,1,53,13]]}
[{"$f":"MdlTtl","v":"SW REZ - DRAFT - Access Fee Calculator"}]
[{"$f":"_xlfn.SHEET()","v":2},{"$f":"_xlfn.TEXTAFTER(CELL(\"filename\",A1),\"]\")","v":"Instructions"}]
[null,"Instructions sheet"]
[]
[]
[{"$f":"Table!B25","v":"All Checks are OK"}]
[]
[]
[{"$f":"ROUNDDOWN(MAX($A$7:OFFSET(A9,-One,0),$A$2*Sht)+Sxn,0)","v":201},"Model Diagram"]
[]
[]
[]
[]
[]
[]
[]
[]
[]
[]
[]
{"$rows_left_out":43}
{"sheet":"VerCon","index":2,"n_rows":13,"n_cols":10,"rows_kept":13,"cut":false,"hidden":false,"merged":[[6,0,6,2]]}
[{"$f":"MdlTtl","v":"SW REZ - DRAFT - Access Fee Calculator"}]
[{"$f":"_xlfn.SHEET()","v":3},{"$f":"_xlfn.TEXTAFTER(CELL(\"filename\",A1),\"]\")","v":"VerCon"}]
[]
[]
[]
[{"$f":"Table!B25","v":"All Checks are OK"}]
[]
[]
[null,null,"Version no","Date","Change Made","Source of Change","Output 1","Output 2","Output 3","Output 4"]
[null,{"$f":"MAX(OFFSET(B10,1,0,100000,1))+1","v":1},"[DRAFT VERSION]",{"$f":"NOW()","v":"2024-05-22T09:45:24.280"},null,null,"Use these cells to link to key model outputs"]
[null,null,"<< insert row above for new file versions to be logged"]
[]
["END"]

{"sheet":"Assumptions","index":3,"n_rows":75,"n_cols":14,"rows_kept":75,"cut":false,"hidden":false,"merged":[[6,0,6,2]]}
[{"$f":"MdlTtl","v":"SW REZ - DRAFT - Access Fee Calculator"}]
[{"$f":"_xlfn.SHEET()","v":4},{"$f":"_xlfn.TEXTAFTER(CELL(\"filename\",A1),\"]\")","v":"Assumptions"}]
[null,"Key assumptions and outputs"]
[]
[]
[{"$f":"Table!B25","v":"All Checks are OK"}]
[]
[]
[{"$f":"ROUNDDOWN(MAX($A$8:OFFSET(A9,-One,0),$A$2*Sht)+Sxn,0)","v":401},"Assumptions"]
[]
[{"$f":"MAX(A$2:OFFSET($A11,-One,0))+Sbsxn","v":401.01},"Model"]
[]
[null,"Model name","text","SW REZ - DRAFT - Access Fee Calculator",null,null,null,null,null,null,null,null,null,"[MdlTtl]"]
[null,"File name","text",{"$f":"IF(ISERROR(LEFT(RIGHT(CELL(\"filename\",$A$7),LEN(CELL(\"filename\",$A$7))-FIND(\"[\",CELL(\"filename\",$A$7))),FIND(\"]\",RIGHT(CELL(\"filename\",$A$7),LEN(CELL(\"filename\",$A$7))-FIND(\"[\",CELL(\"filename\",$A$7))))-1)),\"Please save the model\",LEFT(RIGHT(CELL(\"filename\",$A$7),LEN(CELL(\"filename\",$A$7))-FIND(\"[\",CELL(\"filename\",$A$7))),FIND(\"]\",RIGHT(CELL(\"filename\",$A$7),LEN(CELL(\"filename\",$A$7))-FIND(\"[\",CELL(\"filename\",$A$7))))-1))","v":"SW REZ - DRAFT - Access Fee Calculator.xlsm"},null,null,null,null,null,null,null,null,null,"[MdlFileName]"]
[null,"Model start date","date","2026-01-01",null,null,null,null,null,null,null,null,null,"[Start]"]
[null,"Escalation Base date","date","2024-07-01",null,null,null,null,null,null,null,null,null,"Implicit Model assumption; do not change"]
[null,"Financial year end (month number)","#",6,null,null,null,null,null,null,null,null,null,"Implicit Model assumption; do not change"]
[]
[null,"Scenario number","#",1,1,2,null,null,null,null,null,null,null,"◀  Adjust between base case and variation case"]
[null,"Scenario name","text",{"$f":"+IF(ISBLANK(INDEX(E20:F20,,$D$19)),E20,INDEX(E20:F20,,$D$19))","v":"Base Case"},"Base Case","Variation Case",null,null,null,null,null,null,null,"Implicit Model assumption; do not change"]
{"$rows_left_out":56}
{"sheet":"Calculations","index":4,"n_rows":91,"n_cols":110,"rows_kept":91,"cut":false,"hidden":false,"merged":[[5,0,5,2],[4,3,4,5]]}
[{"$f":"MdlTtl","v":"SW REZ - DRAFT - Access Fee Calculator"},null,null,null,null,null,null,null,null,"Period Start",{"$f":"Start","v":"2026-01-01"},{"$f":"K2+1","v":"2026-04-01"},"2026-07-01","2026-10-01","2027-01-01","2027-04-01","2027-07-01","2027-10-01","2028-01-01","2028-04-01","2028-07-01","2028-10-01","2029-01-01","2029-04-01","2029-07-01","2029-10-01","2030-01-01","2030-04-01","2030-07-01","2030-10-01","2031-01-01","2031-04-01","2031-07-01","2031-10-01","2032-01-01","2032-04-01","2032-07-01","2032-10-01","2033-01-01","2033-04-01","2033-07-01","2033-10-01","2034-01-01","2034-04-01","2034-07-01","2034-10-01","2035-01-01","2035-04-01","2035-07-01","2035-10-01","2036-01-01","2036-04-01","2036-07-01","2036-10-01","2037-01-01","2037-04-01","2037-07-01","2037-10-01","2038-01-01","2038-04-01","2038-07-01","2038-10-01","2039-01-01","2039-04-01","2039-07-01","2039-10-01","2040-01-01","2040-04-01","2040-07-01","2040-10-01","2041-01-01","2041-04-01","2041-07-01","2041-10-01","2042-01-01",{"$f":"BW2+1","v":"2042-04-01"},"2042-07-01","2042-10-01","2043-01-01","2043-04-01","2043-07-01","2043-10-01","2044-01-01","2044-04-01","2044-07-01","2044-10-01","2045-01-01","2045-04-01","2045-07-01","2045-10-01","2046-01-01","2046-04-01","2046-07-01","2046-10-01","2047-01-01","2047-04-01","2047-07-01","2047-10-01","2048-01-01","2048-04-01","2048-07-01","2048-10-01","2049-01-01","2049-04-01","2049-07-01","2049-10-01","2050-01-01","2050-04-01","2050-07-01","2050-10-01"]
[{"$f":"_xlfn.SHEET()","v":5},{"$f":"_xlfn.TEXTAFTER(CELL(\"filename\",A1),\"]\")","v":"Calculations"},null,null,null,null,null,null,null,"Period End",{"$f":"EOMONTH(K1,MiP-1)","v":"2026-03-31"},{"$f":"EOMONTH(L1,MiP-1)","v":"2026-06-30"},{"$f":"EOMONTH(M1,MiP-1)","v":"2026-09-30"},"2026-12-31","2027-03-31","2027-06-30","2027-09-30","2027-12-31","2028-03-31","2028-06-30","2028-09-30","2028-12-31","2029-03-31","2029-06-30","2029-09-30","2029-12-31","2030-03-31","2030-06-30","2030-09-30","2030-12-31","2031-03-31","2031-06-30","2031-09-30","2031-12-31","2032-03-31","2032-06-30","2032-09-30","2032-12-31","2033-03-31","2033-06-30","2033-09-30","2033-12-31","2034-03-31","2034-06-30","2034-09-30","2034-12-31","2035-03-31","2035-06-30","2035-09-30","2035-12-31","2036-03-31","2036-06-30","2036-09-30","2036-12-31","2037-03-31","2037-06-30","2037-09-30","2037-12-31","2038-03-31","2038-06-30","2038-09-30","2038-12-31","2039-03-31","2039-06-30","2039-09-30","2039-12-31","2040-03-31","2040-06-30","2040-09-30","2040-12-31","2041-03-31","2041-06-30","2041-09-30","2041-12-31","2042-03-31","2042-06-30",{"$f":"EOMONTH(BY1,MiP-1)","v":"2042-09-30"},"2042-12-31","2043-03-31","2043-06-30","2043-09-30","2043-12-31","2044-03-31","2044-06-30","2044-09-30","2044-12-31","2045-03-31","2045-06-30","2045-09-30","2045-12-31","2046-03-31","2046-06-30","2046-09-30","2046-12-31","2047-03-31","2047-06-30","2047-09-30","2047-12-31","2048-03-31","2048-06-30","2048-09-30","2048-12-31","2049-03-31","2049-06-30","2049-09-30","2049-12-31","2050-03-31","2050-06-30","2050-09-30","2050-12-31"]
[null,"Main calculation engine for the model",null,null,null,null,"Sum Chks"]
[null,null,null,null,null,null,{"$f":"SUM(G7:G206)","v":0}]
[{"$f":"Table!B25","v":"All Checks are OK"},null,"Units","Assumptions",null,null,"Checks","Alerts","Total","Seed"]
[]
[]
[{"$f":"ROUNDDOWN(MAX($A$7:OFFSET(A8,-One,0),$A$2*Sht)+Sxn,0)","v":501},"Assumptions"]
[]
[{"$f":"MAX(A$2:OFFSET($A10,-One,0))+Sbsxn","v":501.01},"General Flags & Counters"]
[]
[null,"Period start month number","#",null,null,null,null,null,null,null,{"$f":"MONTH(K1)","v":1},4,7,10,1,4,7,10,1,4,7,10,1,4,7,10,1,4,7,10,1,4,7,10,1,4,7,10,1,4,7,10,{"$f":"MONTH(AQ1)","v":1},4,7,10,1,4,7,10,1,4,7,10,1,4,7,10,1,4,7,10,1,4,7,10,1,4,7,10,1,4,7,10,{"$f":"MONTH(BW1)","v":1},4,7,10,1,4,7,10,1,4,7,10,1,4,7,10,1,4,7,10,1,4,7,10,1,4,7,10,1,4,7,10,1,4,7,10]
[null,"Period end month number","#",null,null,null,null,null,null,null,{"$f":"MONTH(K2)","v":3},6,9,12,3,6,9,12,3,6,9,12,3,6,9,12,3,6,9,12,3,6,9,12,3,6,9,12,3,6,9,12,{"$f":"MONTH(AQ2)","v":3},6,9,12,3,6,9,12,3,6,9,12,3,6,9,12,3,6,9,12,3,6,9,12,3,6,9,12,3,6,9,12,{"$f":"MONTH(BW2)","v":3},6,9,12,3,6,9,12,3,6,9,12,3,6,9,12,3,6,9,12,3,6,9,12,3,6,9,12,3,6,9,12,3,6,9,12]
[]
[null,"Calendar year","year",null,null,null,null,null,null,null,{"$f":"YEAR(K2)","v":2026},2026,2026,2026,2027,2027,2027,2027,2028,2028,2028,2028,2029,2029,2029,2029,2030,2030,2030,2030,2031,2031,2031,2031,2032,2032,2032,2032,2033,2033,2033,2033,{"$f":"YEAR(AQ2)","v":2034},2034,2034,2034,2035,2035,2035,2035,2036,2036,2036,2036,2037,2037,2037,2037,2038,2038,2038,2038,2039,2039,2039,2039,2040,2040,2040,2040,2041,2041,2041,2041,{"$f":"YEAR(BW2)","v":2042},2042,2042,2042,2043,2043,2043,2043,2044,2044,2044,2044,2045,2045,2045,2045,2046,2046,2046,2046,2047,2047,2047,2047,2048,2048,2048,2048,2049,2049,2049,2049,2050,2050,2050,2050]
[null,"Financial year","year",{"$f":"Assumptions!D17","v":6},null,null,null,null,null,null,{"$f":"YEAR(K1)+IF(MONTH(K1)>Assumptions!$D$17,1,0)","v":2026},{"$f":"YEAR(L1)+IF(MONTH(L1)>Assumptions!$D$17,1,0)","v":2026},{"$f":"YEAR(M1)+IF(MONTH(M1)>Assumptions!$D$17,1,0)","v":2027},{"$f":"YEAR(N1)+IF(MONTH(N1)>Assumptions!$D$17,1,0)","v":2027},{"$f":"YEAR(O1)+IF(MONTH(O1)>Assumptions!$D$17,1,0)","v":2027},{"$f":"YEAR(P1)+IF(MONTH(P1)>Assumptions!$D$17,1,0)","v":2027},{"$f":"YEAR(Q1)+IF(MONTH(Q1)>Assumptions!$D$17,1,0)","v":2028},{"$f":"YEAR(R1)+IF(MONTH(R1)>Assumptions!$D$17,1,0)","v":2028},{"$f":"YEAR(S1)+IF(MONTH(S1)>Assumptions!$D$17,1,0)","v":2028},{"$f":"YEAR(T1)+IF(MONTH(T1)>Assumptions!$D$17,1,0)","v":2028},{"$f":"YEAR(U1)+IF(MONTH(U1)>Assumptions!$D$17,1,0)","v":2029},{"$f":"YEAR(V1)+IF(MONTH(V1)>Assumptions!$D$17,1,0)","v":2029},{"$f":"YEAR(W1)+IF(MONTH(W1)>Assumptions!$D$17,1,0)","v":2029},{"$f":"YEAR(X1)+IF(MONTH(X1)>Assumptions!$D$17,1,0)","v":2029},{"$f":"YEAR(Y1)+IF(MONTH(Y1)>Assumptions!$D$17,1,0)","v":2030},{"$f":"YEAR(Z1)+IF(MONTH(Z1)>Assumptions!$D$17,1,0)","v":2030},{"$f":"YEAR(AA1)+IF(MONTH(AA1)>Assumptions!$D$17,1,0)","v":2030},{"$f":"YEAR(AB1)+IF(MONTH(AB1)>Assumptions!$D$17,1,0)","v":2030},{"$f":"YEAR(AC1)+IF(MONTH(AC1)>Assumptions!$D$17,1,0)","v":2031},{"$f":"YEAR(AD1)+IF(MONTH(AD1)>Assumptions!$D$17,1,0)","v":2031},{"$f":"YEAR(AE1)+IF(MONTH(AE1)>Assumptions!$D$17,1,0)","v":2031},{"$f":"YEAR(AF1)+IF(MONTH(AF1)>Assumptions!$D$17,1,0)","v":2031},{"$f":"YEAR(AG1)+IF(MONTH(AG1)>Assumptions!$D$17,1,0)","v":2032},{"$f":"YEAR(AH1)+IF(MONTH(AH1)>Assumptions!$D$17,1,0)","v":2032},{"$f":"YEAR(AI1)+IF(MONTH(AI1)>Assumptions!$D$17,1,0)","v":2032},{"$f":"YEAR(AJ1)+IF(MONTH(AJ1)>Assumptions!$D$17,1,0)","v":2032},{"$f":"YEAR(AK1)+IF(MONTH(AK1)>Assumptions!$D$17,1,0)","v":2033},{"$f":"YEAR(AL1)+IF(MONTH(AL1)>Assumptions!$D$17,1,0)","v":2033},{"$f":"YEAR(AM1)+IF(MONTH(AM1)>Assumptions!$D$17,1,0)","v":2033},{"$f":"YEAR(AN1)+IF(MONTH(AN1)>Assumptions!$D$17,1,0)","v":2033},{"$f":"YEAR(AO1)+IF(MONTH(AO1)>Assumptions!$D$17,1,0)","v":2034},{"$f":"YEAR(AP1)+IF(MONTH(AP1)>Assumptions!$D$17,1,0)","v":2034},{"$f":"YEAR(AQ1)+IF(MONTH(AQ1)>Assumptions!$D$17,1,0)","v":2034},{"$f":"YEAR(AR1)+IF(MONTH(AR1)>Assumptions!$D$17,1,0)","v":2034},{"$f":"YEAR(AS1)+IF(MONTH(AS1)>Assumptions!$D$17,1,0)","v":2035},{"$f":"YEAR(AT1)+IF(MONTH(AT1)>Assumptions!$D$17,1,0)","v":2035},{"$f":"YEAR(AU1)+IF(MONTH(AU1)>Assumptions!$D$17,1,0)","v":2035},{"$f":"YEAR(AV1)+IF(MONTH(AV1)>Assumptions!$D$17,1,0)","v":2035},{"$f":"YEAR(AW1)+IF(MONTH(AW1)>Assumptions!$D$17,1,0)","v":2036},{"$f":"YEAR(AX1)+IF(MONTH(AX1)>Assumptions!$D$17,1,0)","v":2036},{"$f":"YEAR(AY1)+IF(MONTH(AY1)>Assumptions!$D$17,1,0)","v":2036},{"$f":"YEAR(AZ1)+IF(MONTH(AZ1)>Assumptions!$D$17,1,0)","v":2036},{"$f":"YEAR(BA1)+IF(MONTH(BA1)>Assumptions!$D$17,1,0)","v":2037},{"$f":"YEAR(BB1)+IF(MONTH(BB1)>Assumptions!$D$17,1,0)","v":2037},{"$f":"YEAR(BC1)+IF(MONTH(BC1)>Assumptions!$D$17,1,0)","v":2037},{"$f":"YEAR(BD1)+IF(MONTH(BD1)>Assumptions!$D$17,1,0)","v":2037},{"$f":"YEAR(BE1)+IF(MONTH(BE1)>Assumptions!$D$17,1,0)","v":2038},{"$f":"YEAR(BF1)+IF(MONTH(BF1)>Assumptions!$D$17,1,0)","v":2038},{"$f":"YEAR(BG1)+IF(MONTH(BG1)>Assumptions!$D$17,1,0)","v":2038},{"$f":"YEAR(BH1)+IF(MONTH(BH1)>Assumptions!$D$17,1,0)","v":2038},{"$f":"YEAR(BI1)+IF(MONTH(BI1)>Assumptions!$D$17,1,0)","v":2039},{"$f":"YEAR(BJ1)+IF(MONTH(BJ1)>Assumptions!$D$17,1,0)","v":2039},{"$f":"YEAR(BK1)+IF(MONTH(BK1)>Assumptions!$D$17,1,0)","v":2039},{"$f":"YEAR(BL1)+IF(MONTH(BL1)>Assumptions!$D$17,1,0)","v":2039},{"$f":"YEAR(BM1)+IF(MONTH(BM1)>Assumptions!$D$17,1,0)","v":2040},{"$f":"YEAR(BN1)+IF(MONTH(BN1)>Assumptions!$D$17,1,0)","v":2040},{"$f":"YEAR(BO1)+IF(MONTH(BO1)>Assumptions!$D$17,1,0)","v":2040},{"$f":"YEAR(BP1)+IF(MONTH(BP1)>Assumptions!$D$17,1,0)","v":2040},{"$f":"YEAR(BQ1)+IF(MONTH(BQ1)>Assumptions!$D$17,1,0)","v":2041},{"$f":"YEAR(BR1)+IF(MONTH(BR1)>Assumptions!$D$17,1,0)","v":2041},{"$f":"YEAR(BS1)+IF(MONTH(BS1)>Assumptions!$D$17,1,0)","v":2041},{"$f":"YEAR(BT1)+IF(MONTH(BT1)>Assumptions!$D$17,1,0)","v":2041},{"$f":"YEAR(BU1)+IF(MONTH(BU1)>Assumptions!$D$17,1,0)","v":2042},{"$f":"YEAR(BV1)+IF(MONTH(BV1)>Assumptions!$D$17,1,0)","v":2042},{"$f":"YEAR(BW1)+IF(MONTH(BW1)>Assumptions!$D$17,1,0)","v":2042},{"$f":"YEAR(BX1)+IF(MONTH(BX1)>Assumptions!$D$17,1,0)","v":2042},{"$f":"YEAR(BY1)+IF(MONTH(BY1)>Assumptions!$D$17,1,0)","v":2043},{"$f":"YEAR(BZ1)+IF(MONTH(BZ1)>Assumptions!$D$17,1,0)","v":2043},{"$f":"YEAR(CA1)+IF(MONTH(CA1)>Assumptions!$D$17,1,0)","v":2043},{"$f":"YEAR(CB1)+IF(MONTH(CB1)>Assumptions!$D$17,1,0)","v":2043},{"$f":"YEAR(CC1)+IF(MONTH(CC1)>Assumptions!$D$17,1,0)","v":2044},{"$f":"YEAR(CD1)+IF(MONTH(CD1)>Assumptions!$D$17,1,0)","v":2044},{"$f":"YEAR(CE1)+IF(MONTH(CE1)>Assumptions!$D$17,1,0)","v":2044},{"$f":"YEAR(CF1)+IF(MONTH(CF1)>Assumptions!$D$17,1,0)","v":2044},{"$f":"YEAR(CG1)+IF(MONTH(CG1)>Assumptions!$D$17,1,0)","v":2045},{"$f":"YEAR(CH1)+IF(MONTH(CH1)>Assumptions!$D$17,1,0)","v":2045},{"$f":"YEAR(CI1)+IF(MONTH(CI1)>Assumptions!$D$17,1,0)","v":2045},{"$f":"YEAR(CJ1)+IF(MONTH(CJ1)>Assumptions!$D$17,1,0)","v":2045},{"$f":"YEAR(CK1)+IF(MONTH(CK1)>Assumptions!$D$17,1,0)","v":2046},{"$f":"YEAR(CL1)+IF(MONTH(CL1)>Assumptions!$D$17,1,0)","v":2046},{"$f":"YEAR(CM1)+IF(MONTH(CM1)>Assumptions!$D$17,1,0)","v":2046},{"$f":"YEAR(CN1)+IF(MONTH(CN1)>Assumptions!$D$17,1,0)","v":2046},{"$f":"YEAR(CO1)+IF(MONTH(CO1)>Assumptions!$D$17,1,0)","v":2047},{"$f":"YEAR(CP1)+IF(MONTH(CP1)>Assumptions!$D$17,1,0)","v":2047},{"$f":"YEAR(CQ1)+IF(MONTH(CQ1)>Assumptions!$D$17,1,0)","v":2047},{"$f":"YEAR(CR1)+IF(MONTH(CR1)>Assumptions!$D$17,1,0)","v":2047},{"$f":"YEAR(CS1)+IF(MONTH(CS1)>Assumptions!$D$17,1,0)","v":2048},{"$f":"YEAR(CT1)+IF(MONTH(CT1)>Assumptions!$D$17,1,0)","v":2048},{"$f":"YEAR(CU1)+IF(MONTH(CU1)>Assumptions!$D$17,1,0)","v":2048},{"$f":"YEAR(CV1)+IF(MONTH(CV1)>Assumptions!$D$17,1,0)","v":2048},{"$f":"YEAR(CW1)+IF(MONTH(CW1)>Assumptions!$D$17,1,0)","v":2049},{"$f":"YEAR(CX1)+IF(MONTH(CX1)>Assumptions!$D$17,1,0)","v":2049},{"$f":"YEAR(CY1)+IF(MONTH(CY1)>Assumptions!$D$17,1,0)","v":2049},{"$f":"YEAR(CZ1)+IF(MONTH(CZ1)>Assumptions!$D$17,1,0)","v":2049},{"$f":"YEAR(DA1)+IF(MONTH(DA1)>Assumptions!$D$17,1,0)","v":2050},{"$f":"YEAR(DB1)+IF(MONTH(DB1)>Assumptions!$D$17,1,0)","v":2050},{"$f":"YEAR(DC1)+IF(MONTH(DC1)>Assumptions!$D$17,1,0)","v":2050},{"$f":"YEAR(DD1)+IF(MONTH(DD1)>Assumptions!$D$17,1,0)","v":2050},{"$f":"YEAR(DE1)+IF(MONTH(DE1)>Assumptions!$D$17,1,0)","v":2051},{"$f":"YEAR(DF1)+IF(MONTH(DF1)>Assumptions!$D$17,1,0)","v":2051}]
[]
[{"$f":"MAX(A$2:OFFSET($A18,-One,0))+Sbsxn","v":501.02},"Project Flags & Counters"]
[]
[null,"Flags"]
{"$rows_left_out":72}
{"sheet":"Fee Schedule - Annual","index":5,"n_rows":65,"n_cols":6,"rows_kept":65,"cut":false,"hidden":false,"merged":[]}
[{"$f":"MdlTtl","v":"SW REZ - DRAFT - Access Fee Calculator"}]
[{"$f":"_xlfn.SHEET()","v":6},{"$f":"_xlfn.TEXTAFTER(CELL(\"filename\",A1),\"]\")","v":"Fee Schedule - Annual"}]
[null,"Initial Access Fee Schedule",null,null,null,"Sum Chks"]
[null,null,null,null,null,{"$f":"SUM(F63)","v":0}]
[]
["All Checks are OK"]
[]
[null,"Annexure A  Initial Access Fee Schedule"]
[null,"Annual fees in AUD$m nominal (including GST)"]
[null,"GST Included:",{"$f":"Assumptions!D44","v":1}]
[null,"Project:",{"$f":"Assumptions!D24","v":"[Insert Project Name]"}]
[null,"Date \n(annual)","C&E Fee \n($m)\n\n\n\n\n","SW REZ Administration  Fee\n($m) \n\n\n","Contribution to the NSW Electricity Infrastructure Roadmap \n($m)\n\n\n","Total Access Fee ($m)\n\n\n\n\n"]
[null,{"$f":"Calculations!$K$16","v":2026},{"$f":"SUMIF(Calculations!$K$16:$DF$16,$B13, Calculations!$K$74:$DF$74)*(1+Assumptions!$D$45)","v":0},{"$f":"SUMIF(Calculations!$K$16:$DF$16,$B13,Calculations!$K$75:$DF$75)*(1+Assumptions!$D$45)","v":0},{"$f":"SUMIF(Calculations!$K$16:$DF$16,$B13, Calculations!$K$76:$DF$76)*(1+Assumptions!$D$45)","v":0},{"$f":"SUM(C13:E13)","v":0}]
[null,{"$f":"B13+1","v":2027},{"$f":"SUMIF(Calculations!$K$16:$DF$16,$B14, Calculations!$K$74:$DF$74)*(1+Assumptions!$D$45)","v":0.22688699685520464},{"$f":"SUMIF(Calculations!$K$16:$DF$16,$B14,Calculations!$K$75:$DF$75)*(1+Assumptions!$D$45)","v":6.8164745576933208E-2},{"$f":"SUMIF(Calculations!$K$16:$DF$16,$B14, Calculations!$K$76:$DF$76)*(1+Assumptions!$D$45)","v":9.9534339055174587E-2},{"$f":"SUM(C14:E14)","v":0.39458608148731245}]
[null,{"$f":"B14+1","v":2028},{"$f":"SUMIF(Calculations!$K$16:$DF$16,$B15, Calculations!$K$74:$DF$74)*(1+Assumptions!$D$45)","v":1.3749721920230249},{"$f":"SUMIF(Calculations!$K$16:$DF$16,$B15,Calculations!$K$75:$DF$75)*(1+Assumptions!$D$45)","v":0.41308947160343917},{"$f":"SUMIF(Calculations!$K$16:$DF$16,$B15, Calculations!$K$76:$DF$76)*(1+Assumptions!$D$45)","v":0.60319432250053595},2.3912559861270002]
[null,{"$f":"B15+1","v":2029},{"$f":"SUMIF(Calculations!$K$16:$DF$16,$B16, Calculations!$K$74:$DF$74)*(1+Assumptions!$D$45)","v":1.4093464968236002},{"$f":"SUMIF(Calculations!$K$16:$DF$16,$B16,Calculations!$K$75:$DF$75)*(1+Assumptions!$D$45)","v":0.42341670839352519},{"$f":"SUMIF(Calculations!$K$16:$DF$16,$B16, Calculations!$K$76:$DF$76)*(1+Assumptions!$D$45)","v":0.61827418056304917},2.4510373857801744]
[null,2030,{"$f":"SUMIF(Calculations!$K$16:$DF$16,$B17, Calculations!$K$74:$DF$74)*(1+Assumptions!$D$45)","v":1.44458015924419},{"$f":"SUMIF(Calculations!$K$16:$DF$16,$B17,Calculations!$K$75:$DF$75)*(1+Assumptions!$D$45)","v":0.43400212610336325},{"$f":"SUMIF(Calculations!$K$16:$DF$16,$B17, Calculations!$K$76:$DF$76)*(1+Assumptions!$D$45)","v":0.63373103507712547},2.5123133204246786]
[null,2031,{"$f":"SUMIF(Calculations!$K$16:$DF$16,$B18, Calculations!$K$74:$DF$74)*(1+Assumptions!$D$45)","v":1.4806946632252949},{"$f":"SUMIF(Calculations!$K$16:$DF$16,$B18,Calculations!$K$75:$DF$75)*(1+Assumptions!$D$45)","v":0.44485217925594728},{"$f":"SUMIF(Calculations!$K$16:$DF$16,$B18, Calculations!$K$76:$DF$76)*(1+Assumptions!$D$45)","v":0.64957431095405349},2.5751211534352958]
[null,2032,{"$f":"SUMIF(Calculations!$K$16:$DF$16,$B19, Calculations!$K$74:$DF$74)*(1+Assumptions!$D$45)","v":1.5177120298059272},{"$f":"SUMIF(Calculations!$K$16:$DF$16,$B19,Calculations!$K$75:$DF$75)*(1+Assumptions!$D$45)","v":0.45597348373734597},{"$f":"SUMIF(Calculations!$K$16:$DF$16,$B19, Calculations!$K$76:$DF$76)*(1+Assumptions!$D$45)","v":0.66581366872790482},2.639499182271178]
[null,2033,{"$f":"SUMIF(Calculations!$K$16:$DF$16,$B20, Calculations!$K$74:$DF$74)*(1+Assumptions!$D$45)","v":1.5556548305510753},{"$f":"SUMIF(Calculations!$K$16:$DF$16,$B20,Calculations!$K$75:$DF$75)*(1+Assumptions!$D$45)","v":0.46737282083077952},{"$f":"SUMIF(Calculations!$K$16:$DF$16,$B20, Calculations!$K$76:$DF$76)*(1+Assumptions!$D$45)","v":0.68245901044610235},2.7054866618279574]
{"$rows_left_out":46}
{"sheet":"Fee Schedule - QTR","index":6,"n_rows":117,"n_cols":6,"rows_kept":117,"cut":false,"hidden":false,"merged":[]}
[{"$f":"MdlTtl","v":"SW REZ - DRAFT - Access Fee Calculator"}]
[{"$f":"_xlfn.SHEET()","v":7},{"$f":"_xlfn.TEXTAFTER(CELL(\"filename\",A1),\"]\")","v":"Fee Schedule - QTR"}]
[null,"Initial Access Fee Schedule",null,null,null,"Sum Chks"]
[null,null,null,null,null,{"$f":"SUM(F115)","v":0}]
[]
["All Checks are OK"]
[]
[null,"Annexure A  Initial Access Fee Schedule"]
[null,"Quarterly fees in AUD$M nominal (including GST)"]
[null,"GST Included:",{"$f":"Assumptions!D44","v":1}]
[null,"Project:",{"$f":"Assumptions!D24","v":"[Insert Project Name]"}]
[null,"Date \n(quarterly)","C&E Fee \n($m)\n\n\n\n\n","SW REZ Administration  Fee\n($m) \n\n\n","Contribution to the NSW Electricity Infrastructure Roadmap \n($m)\n\n\n","Total Access Fee ($m)\n\n\n\n\n"]
[null,{"$f":"Calculations!$K$2","v":"2026-03-31"},{"$f":"SUMIF(Calculations!$K$2:$DF$2,$B13, Calculations!$K$74:$DF$74)*(1+Assumptions!$D$45)","v":0},{"$f":"SUMIF(Calculations!$K$2:$DF$2,$B13, Calculations!$K$75:$DF$75)*(1+Assumptions!$D$45)","v":0},{"$f":"SUMIF(Calculations!$K$2:$DF$2,$B13, Calculations!$K$76:$DF$76)*(1+Assumptions!$D$45)","v":0},{"$f":"SUM(C13:E13)","v":0}]
[null,{"$f":"EOMONTH(B13,MiP)","v":"2026-06-30"},{"$f":"SUMIF(Calculations!$K$2:$DF$2,$B14, Calculations!$K$74:$DF$74)*(1+Assumptions!$D$45)","v":0},{"$f":"SUMIF(Calculations!$K$2:$DF$2,$B14, Calculations!$K$75:$DF$75)*(1+Assumptions!$D$45)","v":0},{"$f":"SUMIF(Calculations!$K$2:$DF$2,$B14, Calculations!$K$76:$DF$76)*(1+Assumptions!$D$45)","v":0},{"$f":"SUM(C14:E14)","v":0}]
[null,"2026-09-30",{"$f":"SUMIF(Calculations!$K$2:$DF$2,$B15, Calculations!$K$74:$DF$74)*(1+Assumptions!$D$45)","v":0},{"$f":"SUMIF(Calculations!$K$2:$DF$2,$B15, Calculations!$K$75:$DF$75)*(1+Assumptions!$D$45)","v":0},{"$f":"SUMIF(Calculations!$K$2:$DF$2,$B15, Calculations!$K$76:$DF$76)*(1+Assumptions!$D$45)","v":0},{"$f":"SUM(C15:E15)","v":0}]
[null,"2026-12-31",{"$f":"SUMIF(Calculations!$K$2:$DF$2,$B16, Calculations!$K$74:$DF$74)*(1+Assumptions!$D$45)","v":0},{"$f":"SUMIF(Calculations!$K$2:$DF$2,$B16, Calculations!$K$75:$DF$75)*(1+Assumptions!$D$45)","v":0},{"$f":"SUMIF(Calculations!$K$2:$DF$2,$B16, Calculations!$K$76:$DF$76)*(1+Assumptions!$D$45)","v":0},{"$f":"SUM(C16:E16)","v":0}]
[null,"2027-03-31",{"$f":"SUMIF(Calculations!$K$2:$DF$2,$B17, Calculations!$K$74:$DF$74)*(1+Assumptions!$D$45)","v":0},{"$f":"SUMIF(Calculations!$K$2:$DF$2,$B17, Calculations!$K$75:$DF$75)*(1+Assumptions!$D$45)","v":0},{"$f":"SUMIF(Calculations!$K$2:$DF$2,$B17, Calculations!$K$76:$DF$76)*(1+Assumptions!$D$45)","v":0},{"$f":"SUM(C17:E17)","v":0}]
[null,"2027-06-30",{"$f":"SUMIF(Calculations!$K$2:$DF$2,$B18, Calculations!$K$74:$DF$74)*(1+Assumptions!$D$45)","v":0.22688699685520464},{"$f":"SUMIF(Calculations!$K$2:$DF$2,$B18, Calculations!$K$75:$DF$75)*(1+Assumptions!$D$45)","v":6.8164745576933208E-2},{"$f":"SUMIF(Calculations!$K$2:$DF$2,$B18, Calculations!$K$76:$DF$76)*(1+Assumptions!$D$45)","v":9.9534339055174587E-2},{"$f":"SUM(C18:E18)","v":0.39458608148731245}]
[null,"2027-09-30",{"$f":"SUMIF(Calculations!$K$2:$DF$2,$B19, Calculations!$K$74:$DF$74)*(1+Assumptions!$D$45)","v":0.34056666015624998},{"$f":"SUMIF(Calculations!$K$2:$DF$2,$B19, Calculations!$K$75:$DF$75)*(1+Assumptions!$D$45)","v":0.10231807050781248},{"$f":"SUMIF(Calculations!$K$2:$DF$2,$B19, Calculations!$K$76:$DF$76)*(1+Assumptions!$D$45)","v":0.14940511308593757},0.59228984375000004]
[null,"2027-12-31",{"$f":"SUMIF(Calculations!$K$2:$DF$2,$B20, Calculations!$K$74:$DF$74)*(1+Assumptions!$D$45)","v":0.34267553280623658},{"$f":"SUMIF(Calculations!$K$2:$DF$2,$B20, Calculations!$K$75:$DF$75)*(1+Assumptions!$D$45)","v":0.10295164920396063},{"$f":"SUMIF(Calculations!$K$2:$DF$2,$B20, Calculations!$K$76:$DF$76)*(1+Assumptions!$D$45)","v":0.15033026634847513},0.59595744835867237]
{"$rows_left_out":98}
{"sheet":"Table","index":7,"n_rows":75,"n_cols":12,"rows_kept":75,"cut":false,"hidden":false,"merged":[[6,0,6,2]]}
[{"$f":"MdlTtl","v":"SW REZ - DRAFT - Access Fee Calculator"}]
[{"$f":"_xlfn.SHEET()","v":8},{"$f":"_xlfn.TEXTAFTER(CELL(\"filename\",A1),\"]\")","v":"Table"}]
[null,"Lists of commonly used constants / technical inputs"]
[]
[]
[{"$f":"B25","v":"All Checks are OK"}]
[]
[]
[{"$f":"ROUNDDOWN(MAX($A$8:OFFSET(A9,-One,0),$A$2*Sht)+Sxn,0)","v":801},"Checks"]
[]
[{"$f":"MAX(A$2:OFFSET($A11,-One,0))+Sbsxn","v":801.01},"Model Checks"]
[]
[null,"Master Check ",null,null,null,null,null,null,null,null,{"$f":"SUM(K15:K16)","v":0}]
[]
[null,"Fee Schedule",null,null,null,null,null,null,null,null,{"$f":"SUM('Fee Schedule - Annual'!F4,'Fee Schedule - QTR'!F4)","v":0}]
[null,"Calculations",null,null,null,null,null,null,null,null,{"$f":"Calculations!G4","v":0}]
[]
[{"$f":"MAX(A$2:OFFSET($A18,-One,0))+Sbsxn","v":801.02},"Check Messages"]
[]
[null,"Sheet","Order",null,null,null,null,null,null,null,"Check Error"]
{"$rows_left_out":55}